Won't Fix
Last Updated: 01 Apr 2019 14:45 by ADMIN
Connecting to pop-up is successful. Using coded step and activebrowser.navigateto(url) to some specific url i.e. "http://www.google.com" results in a "Wait for condition has timed out" error. 

Full error description:
System.TimeoutException: Wait for condition has timed out
   at ArtOfTest.Common.WaitSync.CheckResult(WaitSync wait, String extraExceptionInfo, Object target)
   at ArtOfTest.Common.WaitSync.For[T](Predicate`1 predicate, T target, Boolean invertCondition, Int32 timeout, WaitResultType errorResultType)
   at ArtOfTest.Common.WaitSync.For[T](Predicate`1 predicate, T target, Boolean invertCondition, Int32 timeout)
   at ArtOfTest.WebAii.Core.Browser.WaitUntilReady()
   at ArtOfTest.WebAii.Core.Browser.ExecuteCommand(BrowserCommand request, Boolean performDomRefresh, Boolean waitUntilReady)
   at ArtOfTest.WebAii.Core.Browser.ExecuteCommand(BrowserCommand request)
   at ArtOfTest.WebAii.Core.Browser.InternalNavigateTo(Uri uri, Boolean useDecodedUrl)
   at ArtOfTest.WebAii.Core.Browser.NavigateTo(Uri uri, Boolean useDecodedUrl)

Why, because page loads successfully?
Won't Fix
Last Updated: 18 Jul 2018 07:03 by ADMIN
I run my test list on a remote machine. When I look at the Results tab in Test Studio I don't see the correct image with the failed step. Sometimes I see no images and other times I see the image from the previous step that failed. Never the image at the time of failure from the step I actually want to see. This makes it hard to analyse the results.
Won't Fix
Last Updated: 25 Jun 2018 07:36 by ADMIN
In Windows 10, Microsoft blocks users from opening programs that show that administrator permissions are needed to run the program.

Why is Test Studio configured this way instead of just as an executable program?  I read other posts referencing saving log files and such, but can't the security permissions on the machine itself dictate where files can be saved instead of TS making that distinction out of the gate?

It means I cannot open the program in Windows 10, much less create any tests.  And our IT department is not going to grant admin access on the individual user machines.
Won't Fix
Last Updated: 03 Apr 2018 12:15 by ADMIN
Not sure about exact repro. Sometimes when I open a test with coded steps in Visual Studio I get the following error when I try to run it: 

'17-Dec-16 11:23:32 PM' - System.ArgumentException: String cannot have zero length.
   at System.Reflection.RuntimeAssembly.GetType(RuntimeAssembly assembly, String name, Boolean throwOnError, Boolean ignoreCase, ObjectHandleOnStack type)
   at System.Reflection.RuntimeAssembly.GetType(String name, Boolean throwOnError, Boolean ignoreCase)
   at System.Reflection.Assembly.GetType(String name)
   at ArtOfTest.WebAii.Design.Execution.ExecutionUtils.EnsureTypeExists(Assembly assm, String typeName)
   at ArtOfTest.WebAii.Design.Execution.ExecutionUtils.CreateCodedTestInstance(Test test, TestResult result, String binariesFolder)
   at ArtOfTest.WebAii.Design.Execution.ExecutionEngine.InternalExecuteTest(Test test, TestResult initializationResult)
   at ArtOfTest.WebAii.Design.Execution.TestExecuteProxy.ExecuteTest(ExecuteTestCommand command)

Closing the test, rebuilding and opening it again seems to work. But I think this same issue also causes problems when the test suite is deployed on remote machines. 
Won't Fix
Last Updated: 05 Jan 2018 12:45 by Roland
GetRectangle() function call returns invalid X and Y coordinates under special circumstances.

Steps to reproduce and access to the application are in the internal description.
Won't Fix
Last Updated: 06 Jun 2017 06:32 by ADMIN
Having issues with performing a Select on an HTMLSelect Element using Text or By Value.  TS appears to make the proper selection from the list but then immediately fails.
Failure Information:

ExecuteCommand failed!
InError set by the client. Client Error:
System.InvalidOperationException: Javascript call [var eventObjJSON = 'null';var eventObj = JSON.parse(eventObjJSON);var eventType = "HTMLEvents";var eventName = "change";var evt = document.createEvent(eventType);if (!evt) throw "Error creating event";var altKey = false;var ctrlKey = false;var shiftKey = false;var metaKey = false;if (eventType == "HTMLEvents" || !eventObj) {evt.initEvent(eventName, true, true);}else {if (eventObj.modifiers & 0x01)altKey = true;if (eventObj.modifiers & 0x02)ctrlKey = true;if (eventObj.modifiers & 0x04)shiftKey = true;if (eventObj.modifiers & 0x08)metaKey = true;if (eventType == "MouseEvents") {var button = 0;if (eventObj.button & 1)button = 0;else if (eventObj.button & 2)button = 2;else if (eventObj.button & 4)button = 1;var relatedTarget;if (eventObj.relatedTarget)relatedTarget = eval(eventObj.relatedTarget);evt.initMouseEvent(eventName, true, true, window, 0, eventObj.screenX, eventObj.screenY,0, 0, ctrlKey, altKey, shiftKey, metaKey, button, relatedTarget);}else if (eventType == "KeyboardEvent") {var keyCode;var charCode;keyCode = eventObj.keyCode;if (eventName == "keypress") {charCode = eventObj.keyCode;}else {charCode = 0;}var keyNum = String.fromCharCode(parseInt(keyCode)).toUpperCase().charCodeAt(0);var keyIdentifier = "U+00" + keyNum.toString(16);evt.initKeyboardEvent(true, true, window,keyIdentifier,0, ctrlKey, altKey, shiftKey, metaKey);}}var target = document.getElementsByTagName('select')[5];target.dispatchEvent(evt);] failed! Please make sure the function exists and the call is using the correct prototype signature. Javascript error: [object Error] 
   at ArtOfTest.InternetExplorer.IECommandProcessor.InvokeFunction(String functionCall, Boolean useEval, Boolean returnJson, IHTMLDocument2 doc)
   at ArtOfTest.InternetExplorer.IECommandProcessor.InvokeEvent(IHTMLElement target, BrowserCommand command)
   at ArtOfTest.InternetExplorer.IECommandProcessor.ProcessActionCommands(BrowserCommand request)
   at ArtOfTest.InternetExplorer.IECommandProcessor.ProcessCommandInternal(WebBrowserClass ieInstance, BrowserCommand request, IHTMLDocument2 document)
BrowserCommand (Type:'Action',Info:'NotSet',Action:'InvokeEvent',Target:'ElementId (tagName: 'select',occurrenceIndex: '5')',Data:'onchange--@@--null',ClientId:'Client_0bf8109b-3530-46b9-8bd2-77e5b8e60970',HasFrames:'False',FramesInfo:'',TargetFrameIndex:'-1',InError:'True',Response:'System.InvalidOperationException: Javascript call [var eventObjJSON = 'null';var eventObj = JSON.parse(eventObjJSON);var eventType = "HTMLEvents";var eventName = "change";var evt = document.createEvent(eventType);if (!evt) throw "Error creating event";var altKey = false;var ctrlKey = false;var shiftKey = false;var metaKey = false;if (eventType == "HTMLEvents" || !eventObj) {evt.initEvent(eventName, true, true);}else {if (eventObj.modifiers & 0x01)altKey = true;if (eventObj.modifiers & 0x02)ctrlKey = true;if (eventObj.modifiers & 0x04)shiftKey = true;if (eventObj.modifiers & 0x08)metaKey = true;if (eventType == "MouseEvents") {var button = 0;if (eventObj.button & 1)button = 0;else if (eventObj.button & 2)button = 2;else if (eventObj.button & 4)button = 1;var relatedTarget;if (eventObj.relatedTarget)relatedTarget = eval(eventObj.relatedTarget);evt.initMouseEvent(eventName, true, true, window, 0, eventObj.screenX, eventObj.screenY,0, 0, ctrlKey, altKey, shiftKey, metaKey, button, relatedTarget);}else if (eventType == "KeyboardEvent") {var keyCode;var charCode;keyCode = eventObj.keyCode;if (eventName == "keypress") {charCode = eventObj.keyCode;}else {charCode = 0;}var keyNum = String.fromCharCode(parseInt(keyCode)).toUpperCase().charCodeAt(0);var keyIdentifier = "U+00" + keyNum.toString(16);evt.initKeyboardEvent(true, true, window,keyIdentifier,0, ctrlKey, altKey, shiftKey, metaKey);}}var target = document.getElementsByTagName('select')[5];target.dispatchEvent(evt);] failed! Please make sure the function exists and the call is using the correct prototype signature. Javascript error: [object Error] 
   at ArtOfTest.InternetExplorer.IECommandProcessor.InvokeFunction(String functionCall, Boolean useEval, Boolean returnJson, IHTMLDocument2 doc)
   at ArtOfTest.InternetExplorer.IECommandProcessor.InvokeEvent(IHTMLElement target, BrowserCommand command)
   at ArtOfTest.InternetExplorer.IECommandProcessor.ProcessActionCommands(BrowserCommand request)
   at ArtOfTest.InternetExplorer.IECommandProcessor.ProcessCommandInternal(WebBrowserClass ieInstance, BrowserCommand request, IHTMLDocument2 document)')
InnerException: none.

InnerException:
ArtOfTest.WebAii.Exceptions.ExecuteCommandException: ExecuteCommand failed!
InError set by the client. Client Error:
System.InvalidOperationException: Javascript call [var eventObjJSON = 'null';var eventObj = JSON.parse(eventObjJSON);var eventType = "HTMLEvents";var eventName = "change";var evt = document.createEvent(eventType);if (!evt) throw "Error creating event";var altKey = false;var ctrlKey = false;var shiftKey = false;var metaKey = false;if (eventType == "HTMLEvents" || !eventObj) {evt.initEvent(eventName, true, true);}else {if (eventObj.modifiers & 0x01)altKey = true;if (eventObj.modifiers & 0x02)ctrlKey = true;if (eventObj.modifiers & 0x04)shiftKey = true;if (eventObj.modifiers & 0x08)metaKey = true;if (eventType == "MouseEvents") {var button = 0;if (eventObj.button & 1)button = 0;else if (eventObj.button & 2)button = 2;else if (eventObj.button & 4)button = 1;var relatedTarget;if (eventObj.relatedTarget)relatedTarget = eval(eventObj.relatedTarget);evt.initMouseEvent(eventName, true, true, window, 0, eventObj.screenX, eventObj.screenY,0, 0, ctrlKey, altKey, shiftKey, metaKey, button, relatedTarget);}else if (eventType == "KeyboardEvent") {var keyCode;var charCode;keyCode = eventObj.keyCode;if (eventName == "keypress") {charCode = eventObj.keyCode;}else {charCode = 0;}var keyNum = String.fromCharCode(parseInt(keyCode)).toUpperCase().charCodeAt(0);var keyIdentifier = "U+00" + keyNum.toString(16);evt.initKeyboardEvent(true, true, window,keyIdentifier,0, ctrlKey, altKey, shiftKey, metaKey);}}var target = document.getElementsByTagName('select')[5];target.dispatchEvent(evt);] failed! Please make sure the function exists and the call is using the correct prototype signature. Javascript error: [object Error] 
   at ArtOfTest.InternetExplorer.IECommandProcessor.InvokeFunction(String functionCall, Boolean useEval, Boolean returnJson, IHTMLDocument2 doc)
   at ArtOfTest.InternetExplorer.IECommandProcessor.InvokeEvent(IHTMLElement target, BrowserCommand command)
   at ArtOfTest.InternetExplorer.IECommandProcessor.ProcessActionCommands(BrowserCommand request)
   at ArtOfTest.InternetExplorer.IECommandProcessor.ProcessCommandInternal(WebBrowserClass ieInstance, BrowserCommand request, IHTMLDocument2 document)
BrowserCommand (Type:'Action',Info:'NotSet',Action:'InvokeEvent',Target:'ElementId (tagName: 'select',occurrenceIndex: '5')',Data:'onchange--@@--null',ClientId:'Client_0bf8109b-3530-46b9-8bd2-77e5b8e60970',HasFrames:'False',FramesInfo:'',TargetFrameIndex:'-1',InError:'True',Response:'System.InvalidOperationException: Javascript call [var eventObjJSON = 'null';var eventObj = JSON.parse(eventObjJSON);var eventType = "HTMLEvents";var eventName = "change";var evt = document.createEvent(eventType);if (!evt) throw "Error creating event";var altKey = false;var ctrlKey = false;var shiftKey = false;var metaKey = false;if (eventType == "HTMLEvents" || !eventObj) {evt.initEvent(eventName, true, true);}else {if (eventObj.modifiers & 0x01)altKey = true;if (eventObj.modifiers & 0x02)ctrlKey = true;if (eventObj.modifiers & 0x04)shiftKey = true;if (eventObj.modifiers & 0x08)metaKey = true;if (eventType == "MouseEvents") {var button = 0;if (eventObj.button & 1)button = 0;else if (eventObj.button & 2)button = 2;else if (eventObj.button & 4)button = 1;var relatedTarget;if (eventObj.relatedTarget)relatedTarget = eval(eventObj.relatedTarget);evt.initMouseEvent(eventName, true, true, window, 0, eventObj.screenX, eventObj.screenY,0, 0, ctrlKey, altKey, shiftKey, metaKey, button, relatedTarget);}else if (eventType == "KeyboardEvent") {var keyCode;var charCode;keyCode = eventObj.keyCode;if (eventName == "keypress") {charCode = eventObj.keyCode;}else {charCode = 0;}var keyNum = String.fromCharCode(parseInt(keyCode)).toUpperCase().charCodeAt(0);var keyIdentifier = "U+00" + keyNum.toString(16);evt.initKeyboardEvent(true, true, window,keyIdentifier,0, ctrlKey, altKey, shiftKey, metaKey);}}var target = document.getElementsByTagName('select')[5];target.dispatchEvent(evt);] failed! Please make sure the function exists and the call is using the correct prototype signature. Javascript error: [object Error] 
   at ArtOfTest.InternetExplorer.IECommandProcessor.InvokeFunction(String functionCall, Boolean useEval, Boolean returnJson, IHTMLDocument2 doc)
   at ArtOfTest.InternetExplorer.IECommandProcessor.InvokeEvent(IHTMLElement target, BrowserCommand command)
   at ArtOfTest.InternetExplorer.IECommandProcessor.ProcessActionCommands(BrowserCommand request)
   at ArtOfTest.InternetExplorer.IECommandProcessor.ProcessCommandInternal(WebBrowserClass ieInstance, BrowserCommand request, IHTMLDocument2 document)')
InnerException: none.

   at ArtOfTest.WebAii.Core.Browser.ExecuteCommandInternal(BrowserCommand request)
   at ArtOfTest.WebAii.Core.Browser.ExecuteCommand(BrowserCommand request, Boolean performDomRefresh, Boolean waitUntilReady)
   at ArtOfTest.WebAii.Core.Browser.ExecuteCommand(BrowserCommand request)
   at ArtOfTest.WebAii.Core.Actions.InvokeEvent(Element targetElement, ScriptEventType eventType)
   at ArtOfTest.WebAii.Controls.HtmlControls.HtmlControl.InvokeEvent(ScriptEventType eventType)
   at ArtOfTest.WebAii.Controls.HtmlControls.HtmlSelect.InvokeOnChange(Boolean initEvent)
   at ArtOfTest.WebAii.Design.IntrinsicTranslators.Descriptors.SelectDropDownActionDescriptor.Execute(Browser browser)
   at ArtOfTest.WebAii.Design.Extensibility.HtmlActionDescriptor.Execute(IAutomationHost autoHost)
   at ArtOfTest.WebAii.Design.Execution.ExecutionEngine.ExecuteStep(Int32 order)
Won't Fix
Last Updated: 31 May 2017 10:05 by ADMIN
Steps to reproduce and access to the application are in the internal description.
Won't Fix
Last Updated: 19 Apr 2017 08:05 by ADMIN
Steps to reproduce and access to the application are in the internal description.
Won't Fix
Last Updated: 03 Apr 2017 13:27 by Roland
Steps to reproduce and access to the application are in the internal description.
Won't Fix
Last Updated: 31 Mar 2017 13:08 by ADMIN
The application starts with a log in screen. After login in it disappears and the actual application is launched, however Test Studio has no time to connect to the second window and throws the following exception:

Element was 'not found'. Criteria: Element 'Exists'.

Page being searched 'WpfWindow_16450718'.

The workaround is to insert an execution delay more than 5 secs after the login. 

The steps to reproduce and access to the application are in the internal description.
Won't Fix
Last Updated: 14 Mar 2017 15:40 by Sebastien AUROUX
Access to the application and steps to reproduce are in the internal description.
Won't Fix
Last Updated: 10 Feb 2017 08:30 by ADMIN
Steps to reproduce:

1. Create a web test.

2. Highlight an element, select JavaScript events and choose one of the events  from the elements menu.

3. Run the test remotely on a locked machine.

Expected: The JavaScript event should be triggered.

Actual: The step fails with the following exception:

ExecuteCommand failed!
InError set by the client. Client Error:
System.InvalidOperationException: Javascript call [var eventObjJSON = 'null';var eventObj = JSON.parse(eventObjJSON);var eventType = "MouseEvents";var eventName = "click";var evt = document.createEvent(eventType);if (!evt) throw "Error creating event";var altKey = false;var ctrlKey = false;var shiftKey = false;var metaKey = false;if (eventType == "HTMLEvents" || !eventObj) {evt.initEvent(eventName, true, true);}else {if (eventObj.modifiers & 0x01)altKey = true;if (eventObj.modifiers & 0x02)ctrlKey = true;if (eventObj.modifiers & 0x04)shiftKey = true;if (eventObj.modifiers & 0x08)metaKey = true;if (eventType == "MouseEvents") {var button = 0;if (eventObj.button & 1)button = 0;else if (eventObj.button & 2)button = 2;else if (eventObj.button & 4)button = 1;var relatedTarget;if (eventObj.relatedTarget)relatedTarget = eval(eventObj.relatedTarget);evt.initMouseEvent(eventName, true, true, window, 0, eventObj.screenX, eventObj.screenY,0, 0, ctrlKey, altKey, shiftKey, metaKey, button, relatedTarget);}else if (eventType == "KeyboardEvent") {var keyCode;var charCode;keyCode = eventObj.keyCode;if (eventName == "keypress") {charCode = eventObj.keyCode;}else {charCode = 0;}var keyNum = String.fromCharCode(parseInt(keyCode)).toUpperCase().charCodeAt(0);var keyIdentifier = "U+00" + keyNum.toString(16);evt.initKeyboardEvent(true, true, window,keyIdentifier,0, ctrlKey, altKey, shiftKey, metaKey);}}var target = document.getElementsByTagName('button')[0];target.dispatchEvent(evt);] failed! Please make sure the function exists and the call is using the correct prototype signature. Javascript error: [object Error] 
   at ArtOfTest.InternetExplorer.IECommandProcessor.InvokeFunction(String functionCall, Boolean useEval, Boolean returnJson, IHTMLDocument2 doc)
   at ArtOfTest.InternetExplorer.IECommandProcessor.InvokeEvent(IHTMLElement target, BrowserCommand command)
   at ArtOfTest.InternetExplorer.IECommandProcessor.ProcessActionCommands(BrowserCommand request)
   at ArtOfTest.InternetExplorer.IECommandProcessor.ProcessCommandInternal(WebBrowserClass ieInstance, BrowserCommand request, IHTMLDocument2 document)
BrowserCommand (Type:'Action',Info:'NotSet',Action:'InvokeEvent',Target:'ElementId (tagName: 'button',occurrenceIndex: '0')',Data:'onclick--@@--null',ClientId:'Client_9d2a2f4a-9726-48e4-b794-12fd1643390c',HasFrames:'False',FramesInfo:'',TargetFrameIndex:'-1',InError:'True',Response:'System.InvalidOperationException: Javascript call [var eventObjJSON = 'null';var eventObj = JSON.parse(eventObjJSON);var eventType = "MouseEvents";var eventName = "click";var evt = document.createEvent(eventType);if (!evt) throw "Error creating event";var altKey = false;var ctrlKey = false;var shiftKey = false;var metaKey = false;if (eventType == "HTMLEvents" || !eventObj) {evt.initEvent(eventName, true, true);}else {if (eventObj.modifiers & 0x01)altKey = true;if (eventObj.modifiers & 0x02)ctrlKey = true;if (eventObj.modifiers & 0x04)shiftKey = true;if (eventObj.modifiers & 0x08)metaKey = true;if (eventType == "MouseEvents") {var button = 0;if (eventObj.button & 1)button = 0;else if (eventObj.button & 2)button = 2;else if (eventObj.button & 4)button = 1;var relatedTarget;if (eventObj.relatedTarget)relatedTarget = eval(eventObj.relatedTarget);evt.initMouseEvent(eventName, true, true, window, 0, eventObj.screenX, eventObj.screenY,0, 0, ctrlKey, altKey, shiftKey, metaKey, button, relatedTarget);}else if (eventType == "KeyboardEvent") {var keyCode;var charCode;keyCode = eventObj.keyCode;if (eventName == "keypress") {charCode = eventObj.keyCode;}else {charCode = 0;}var keyNum = String.fromCharCode(parseInt(keyCode)).toUpperCase().charCodeAt(0);var keyIdentifier = "U+00" + keyNum.toString(16);evt.initKeyboardEvent(true, true, window,keyIdentifier,0, ctrlKey, altKey, shiftKey, metaKey);}}var target = document.getElementsByTagName('button')[0];target.dispatchEvent(evt);] failed! Please make sure the function exists and the call is using the correct prototype signature. Javascript error: [object Error] 
   at ArtOfTest.InternetExplorer.IECommandProcessor.InvokeFunction(String functionCall, Boolean useEval, Boolean returnJson, IHTMLDocument2 doc)
   at ArtOfTest.InternetExplorer.IECommandProcessor.InvokeEvent(IHTMLElement target, BrowserCommand command)
   at ArtOfTest.InternetExplorer.IECommandProcessor.ProcessActionCommands(BrowserCommand request)
   at ArtOfTest.InternetExplorer.IECommandProcessor.ProcessCommandInternal(WebBrowserClass ieInstance, BrowserCommand request, IHTMLDocument2 document)')
InnerException: none.



The workaround is to trigger the events directly in the browser through a coded step:

ActiveBrowser.Actions.InvokeScript("document.getElementById('myButton').onclick();"); 


Won't Fix
Last Updated: 19 Dec 2016 09:28 by ADMIN
For a scheduled list we have had issues for several days with the email indicating 
Run Summary:	0 of 0 test(s) run; 0 passed, 0 failed, 0 not run  while the Results Tab shows that test have executed and gives more appropriate pass and failure information.   
We would like the emails to match the actual results. 
See attached pdf for example screen shots. 
Won't Fix
Last Updated: 14 Oct 2016 17:15 by chris
Steps to Reproduce:
Step 1: Create a test list and click on Schedule Test List  for execution.

Step 2: Configure the SMTP settings.

Step 3: On step 3(Select Notification Settings), upon selecting the option- Send test results by email, the email customization area to enter email addresses gets enabled.

Step 4: Enter the distribution list here.

Expected Result: All the email recipients in the distribution list must receive the email notification, upon the execution of the test list.

Actual Result: Sometimes, only the first recipient from the distribution list receives the email notification, else there is no email being sent at all. 
When multiple distribution lists are entered, same results are observed.
Won't Fix
Last Updated: 13 Oct 2016 06:45 by ADMIN
1. Schedule a  failing test list (i.e. element not found) with SMTP settings configured.

2. On step 3 where the notification settings are, select Only on unexpected errors (not related to the app) radio button.

Expected behavior: The test list is executed and it is failed, no email notification should be received

Actual behavior: The test list is executed, marked as failed and the email notification is received 
Won't Fix
Last Updated: 04 Oct 2016 06:57 by ADMIN
Created by: Valentijn
Comments: 1
Type: Bug Report
0
undock is very comfortable (especially working with 2 screens)

however there is no auto(re)size of the window , option
and the sidebar is on top of the elements.

Won't Fix
Last Updated: 04 Oct 2016 06:52 by ADMIN
high priority bug i think:

when using google chrome, 
testing on my testpage 

the quickstep menu disappears (to background) so i can't click a thing.
It should always stay visible to select things (right? :) )

Can it be that 'on_top' HTML elements of the page overrule the 'On_top' settings of Telerik? (it's something like such i think)



also:

when moving away from that Chrome Tab to for example an Internet Explorer TAB then back again to Chrome Tab causes to be no longer RED indicated 'Highlight Element'
(it acts just as a normal page withouth the Telerik options)
Won't Fix
Last Updated: 04 Oct 2016 06:48 by ADMIN
highlight element DOCK stays on previous browser

Run a test with Chrome.
(best to test 'Run to here')

Go to Highlight element dock


now switch preferred browser van Chrome to Internet Explorer.


the highlight element dock stays with Chrome, but does not appear on Explorer.
Won't Fix
Last Updated: 04 Oct 2016 06:34 by ADMIN
Created by: Valentijn
Comments: 1
Type: Bug Report
1
'submit a ticket' (for trial version (2016.2.630.0)) does not work.

screen doesn't react/response... it hangs.

which is a pitty because new (objectively) users have nice feedback sometimes.
Won't Fix
Last Updated: 04 Oct 2016 06:30 by ADMIN
Created by: Valentijn
Comments: 1
Type: Bug Report
0
create a directory
select 3 tests
run
first test fails

but what about the rest now? There is no result of the other tests
a) at a fail it stops, and also stops the rest
b) the other tests should run.

anyhow, you'd like the results of ALL tests, not the first one.
1 2 3 4